Consent,Age,SexOrient,Race,Race_7_TEXT,Job,Job_7_TEXT,Edu,SocClass,Rel,Rel_7_TEXT,Rel_Same,Region,Region_6_TEXT,InclQ,Misc,Disclose,StillB,MiscVsStill,ManyLoss,NrLoss,Years1Loss,Q15,YearsRLoss,Time6mo,Q16,TotalNrLoss,Gest1Loss,Gest2Loss,Gest3Loss,Gest4Loss,Gest5Loss,Gest6Loss,Gest7Loss,Child,ChildTime,IVF,PersonQ,TraumaQ,COVID_19,Q52,PTG_1,PTG_2,PTG_3,PTG_4,PTG_5,PTG_6,PTG_val,PTG_7,PTG_8,PTG_9,PTG_10,PTG_11,PTG_12,PTG_13,PTG_14,PTG_15,PTG_16,PTG_17,PTG_18,PTG_19,PTG_20,PTG_21,PTG_Total,PTG_Rel,PTG_NewPos,PTG_PerSt,PTG_Spirit,PTG_Life,ECR_S_1,ECR_S_2,ECR_S_3,ECR_S_4,ECR_S_5,ECR_S_6,ECR_S_7,ECR_S_8,ECR_S_9,ECR_S_10,ECR_S_11,ECR_S_12,ECR_Anx,ECR_Avoid,SRQ_1,SRQ_2,SRQ_3,SRQ_4,SRQ_5,SRQ_6,SRQ_7,SRQ_8,SRQ_9,SRQ_10,SRQ_11,SRQ_12,SRQ_13,SRQ_14,SRQ_15,SRQ_16,SRQ_17,SRQ_18,SRQ_19,SRQ_Emo,SRQ_Info,SRQ_Comp,ERRI_1,ERRI_2,ERRI_3,ERRI_4,ERRI_5,ERRI_6,ERRI_7,ERRI_8,ERRI_9,ERRI_10,ERRI_Val,ERRI_11,ERRI_12,ERRI_13,ERRI_14,ERRI_15,ERRI_16,ERRI_17,ERRI_18,ERRI_19,ERRI_20,ERRI_IR,ERRI_DR,ProFace,Pro1qua,ProPFrq,ProPCurr,ProPdur,ProOnline,ProOQual,ProOFrq,ProOdur,PerVsOnl,VolOrNot,IRI_1,IRI_2,IRI_3,IRI_4,IRI_5,IRI_6,IRI_7,IRI_8,IRI_9,IRI_10,IRI_11,IRI_12,IRI_13,IRI_14,IRI_15,IRI_16,IRI_17,IRI_18,IRI_19,IRI_20,IRI_21,IRI_22,IRI_23,IRI_24,IRI_25,IRI_26,IRI_27,IRI_28,IRI_29,IRI_PT,IRI_FS,IRI_EC,IRI_PD,IRI_Total,DDI_1,DDI_2,DDI_3,DDI_4,DDI_5,DDI_6,DDI_7,DDI_8,DDI_9,DDI_10,DDI_11,DDI_12,DDI_Total,Rel_Loss,DCI_1,DCI_2,DCI_3,DCI_4,DCI_5,DCI_6,DCI_7,DCI_8,DCI_9,DCI_10,DCI_11,DCI_12,DCI_13,DCI_14,DCI_15,DCI_16,DCI_17,DCI_18,DCI_19,DCI_20,DCI_Val,DCI_21,DCI_22,DCI_23,DCI_24,DCI_25,DCI_26,DCI_27,DCI_28,DCI_29,DCI_30,DCI_31,DCI_32,DCI_33,DCI_34,DCI_35,DCI_36,DCI_37,SCO,SDC,DDCO,NDCO,SCP,SDCP,DDCP,NDCP,CDC,EDC,DCI_Total,ZPTG_Total,ZPTG_Rel,ZPTG_NewPos,ZPTG_PerSt,ZPTG_Spirit,ZECR_Anx,ZECR_Avoid,ZSRQ_Emo,ZSRQ_Info,ZSRQ_Comp,ZERRI_IR,ZERRI_DR,ZIRI_PT,ZIRI_FS,ZIRI_EC,ZIRI_PD,ZIRI_Total,ZDDI_Total,ZSCO,ZSDC,ZDDCO,ZNDCO,ZSCP,ZSDCP,ZDDCP,ZNDCP,ZCDC,ZEDC,ZDCI_Total,PRE_1,RES_1,ZPR_1,ZRE_1,PRE_2,RES_2,ZPR_2,ZRE_2,PRE_3,RES_3,ZPR_3,ZRE_3,filter_$
1.0,31.0,4.0,2.0,,2.0,,5.0,3.0,1.0,,6.0,2.0,,1.0,1.0,1.0,0.0,1.0,1.0,,,,,,,,,,,,,,,2.0,,1.0,6.0,7.0,1.0,,4.0,3.0,2.0,3.0,4.0,4.0,5.0,4.0,4.0,3.0,3.0,4.0,3.0,4.0,4.0,4.0,3.0,3.0,4.0,4.0,3.0,4.0,74.0,25.0,17.0,13.0,4.0,11.0,2.0,5.0,5.0,6.0,3.0,5.0,6.0,3.0,3.0,5.0,4.0,5.0,29.0,23.0,2.0,3.0,2.0,2.0,3.0,2.0,2.0,2.0,2.0,3.0,2.0,2.0,3.0,1.0,2.0,3.0,2.0,2.0,2.0,33.0,9.0,42.0,2.0,1.0,1.0,2.0,2.0,2.0,1.0,2.0,1.0,1.0,3.0,2.0,2.0,2.0,1.0,1.0,2.0,1.0,2.0,2.0,2.0,15.0,17.0,1.0,,3.0,5.0,2.0,0.0,,2.0,2.0,1.0,2.0,4.0,3.0,3.0,3.0,4.0,4.0,2.0,3.0,3.0,5.0,4.0,3.0,2.0,2.0,2.0,3.0,4.0,2.0,2.0,3.0,3.0,3.0,4.0,3.0,3.0,4.0,3.0,3.0,4.0,21.0,24.0,19.0,23.0,91.0,4.0,4.0,3.0,2.0,3.0,3.0,3.0,2.0,2.0,2.0,3.0,4.0,35.0,1.0,4.0,3.0,3.0,4.0,4.0,3.0,3.0,4.0,3.0,3.0,3.0,4.0,3.0,3.0,2.0,4.0,3.0,3.0,4.0,3.0,3.0,4.0,3.0,3.0,3.0,4.0,3.0,3.0,3.0,4.0,4.0,3.0,3.0,4.0,3.0,3.0,3.0,4.0,14.0,17.0,7.0,13.0,14.0,17.0,7.0,11.0,16.0,7.0,116.0,0.8758134485283153,0.7935717868656437,1.0385511302717352,0.22145964650418057,0.735437757322457,0.7563109560114147,1.3868239206031483,-0.2851835973313655,0.7314702933590127,-0.0016727173203668947,-0.06046436920072744,0.21052698413449,-0.5665425270189067,0.45540128185124495,-1.59505093713032,-0.5493880622136215,-0.6802861867308451,-0.26318238370587105,-0.3927650766994065,-0.675633427699384,-0.5664915869484705,-1.194968039489395,0.3236797527184851,-0.28247468762894706,0.014082621742737248,-1.1108898309400113,-0.46974997199973423,-0.23759024159414865,-0.782759803156177,2.4254648819508007,0.5745351180491993,-0.2504211234009135,0.3626830944336522,2.648856672269303,0.3511433277306968,0.05624757263865071,0.2235198428935057,3.010957325080484,-0.010957325080484193,2.0190061111929984,-0.006733751819739743,
1.0,25.0,4.0,2.0,,2.0,,7.0,3.0,3.0,,6.0,5.0,,1.0,1.0,1.0,0.0,1.0,2.0,1,0.17,2 months,,,,1.0,5.0,,,,,,,2.0,,2.0,9.0,8.0,1.0,I was admitted to the hospital on two separate occasions and I was not allowed a support person.,2.0,4.0,3.0,0.0,4.0,5.0,5.0,0.0,5.0,4.0,5.0,3.0,5.0,3.0,0.0,4.0,3.0,5.0,4.0,5.0,3.0,4.0,71.0,28.0,11.0,15.0,4.0,9.0,1.0,6.0,3.0,2.0,2.0,6.0,1.0,3.0,1.0,5.0,1.0,4.0,26.0,9.0,4.0,4.0,4.0,2.0,2.0,2.0,2.0,2.0,1.0,0.0,2.0,2.0,1.0,3.0,2.0,2.0,2.0,2.0,1.0,33.0,7.0,40.0,2.0,2.0,2.0,2.0,2.0,2.0,2.0,2.0,2.0,2.0,3.0,3.0,1.0,0.0,3.0,3.0,3.0,3.0,0.0,2.0,3.0,20.0,21.0,0.0,,0.0,5.0,0.0,0.0,,0.0,1.0,0.0,1.0,4.0,5.0,5.0,2.0,5.0,1.0,5.0,4.0,5.0,5.0,1.0,1.0,5.0,2.0,5.0,2.0,5.0,5.0,5.0,5.0,5.0,4.0,5.0,5.0,1.0,4.0,5.0,1.0,4.0,22.0,26.0,28.0,31.0,111.0,4.0,4.0,4.0,5.0,3.0,4.0,4.0,5.0,5.0,5.0,4.0,2.0,49.0,1.0,4.0,3.0,4.0,5.0,4.0,4.0,3.0,4.0,4.0,4.0,4.0,3.0,4.0,3.0,3.0,3.0,4.0,4.0,4.0,4.0,5.0,5.0,4.0,4.0,4.0,5.0,4.0,5.0,3.0,4.0,3.0,4.0,4.0,4.0,4.0,3.0,4.0,4.0,16.0,21.0,6.0,18.0,15.0,20.0,6.0,14.0,19.0,8.0,135.0,0.7471388034669689,1.1313131850934943,0.12013610662812936,0.6331874400049106,0.735437757322457,0.34414869041526563,-0.7784240617861079,-0.2851835973313655,0.25035706751995407,-0.1466415517520422,0.4573052291273401,0.644877393506701,-0.269490499338726,1.0848002232777259,1.645086964997453,1.2904231228738603,1.344718246228572,0.9102677662522592,0.27799606078074784,0.7528486765793113,-1.1772767547694545,0.4594073080465051,0.6149915301651204,0.37949486909420715,-0.4506438957675515,-0.3696679233688323,0.19508742006546256,0.20388949810561552,0.1896687215340047,2.3023666887606398,2.6976333112393602,-0.46895697235882317,1.7029176567824846,2.8418881386118335,2.1581118613881665,0.44171797539016305,1.3737433865582307,2.7839920387786816,2.2160079612213184,1.0315858296889868,1.3618330689128757,
1.0,33.0,4.0,2.0,,6.0,,7.0,4.0,3.0,,6.0,5.0,,1.0,0.0,,0.0,,2.0,1,0.75,9 months,,,,1.0,23.0,,,,,,,2.0,,2.0,9.0,9.0,1.0,"Unable to visit closely with family and friends, unable to receive physical support like hugs and warmth, having to receive therapy via telehealth instead of in person",4.0,0.0,3.0,0.0,0.0,3.0,5.0,2.0,0.0,4.0,4.0,0.0,4.0,0.0,1.0,2.0,2.0,2.0,0.0,4.0,2.0,0.0,37.0,13.0,8.0,12.0,0.0,4.0,1.0,2.0,1.0,1.0,1.0,1.0,1.0,1.0,1.0,5.0,1.0,1.0,11.0,6.0,,,,,,,,,,,,,,,,,,,,,,,3.0,2.0,1.0,1.0,1.0,1.0,3.0,2.0,2.0,0.0,3.0,0.0,1.0,0.0,0.0,2.0,3.0,3.0,0.0,2.0,2.0,16.0,13.0,1.0,rasied funds for the Pregnancy After Loss Support 5K,1.0,5.0,1.0,1.0,Sharing PALS articles and other posts from pregnancy loss instagram accounts,1.0,4.0,3.0,2.0,4.0,2.0,3.0,3.0,2.0,4.0,1.0,2.0,3.0,5.0,4.0,4.0,1.0,3.0,3.0,2.0,1.0,5.0,5.0,3.0,3.0,2.0,2.0,1.0,1.0,1.0,2.0,1.0,2.0,17.0,16.0,21.0,19.0,75.0,5.0,5.0,5.0,5.0,5.0,5.0,5.0,5.0,5.0,5.0,4.0,5.0,59.0,1.0,5.0,5.0,5.0,5.0,5.0,4.0,4.0,4.0,5.0,5.0,5.0,5.0,5.0,5.0,5.0,5.0,5.0,4.0,4.0,5.0,5.0,5.0,3.0,1.0,4.0,5.0,5.0,5.0,5.0,5.0,5.0,5.0,5.0,5.0,4.0,4.0,5.0,5.0,20.0,20.0,10.0,18.0,18.0,23.0,10.0,19.0,23.0,10.0,161.0,-0.7111738405616242,-0.557393806045759,-0.3390714051936735,0.015595749753815606,-1.3612746393635984,-1.7166626375654799,-1.2424057722980915,,,,0.04308955046488608,-0.223823425237721,-1.7547506377396296,-2.0621944838546784,-0.8750202922130371,-1.4692936547573623,-2.3002897330983787,1.7484464447937809,1.6195183357410565,0.3957281505096375,1.2658639165144818,0.4594073080465051,1.4889268625050263,1.0414644258173613,1.4082621742736035,0.8657019225831325,1.0815372761523916,1.086848977505144,1.5203603868995164,3.617372156023704,0.3826278439762958,1.8655682446660196,0.2415390219156561,,,,,2.7327089615709443,1.2672910384290557,0.8084770390983363,0.7788053446876864,
1.0,20.0,3.0,2.0,,4.0,,3.0,2.0,1.0,,6.0,2.0,,1.0,1.0,1.0,0.0,1.0,1.0,2,1.5,1 1/2 years ago,,2.0,9 months ago,,4.5,5.5,,,,,,2.0,,2.0,9.0,8.0,1.0,,5.0,5.0,3.0,5.0,4.0,0.0,,3.0,5.0,5.0,5.0,5.0,3.0,3.0,0.0,3.0,5.0,4.0,0.0,0.0,1.0,1.0,,,,,,,1.0,6.0,1.0,1.0,1.0,5.0,1.0,6.0,1.0,5.0,1.0,2.0,,,3.0,3.0,3.0,4.0,3.0,3.0,4.0,4.0,3.0,2.0,3.0,2.0,3.0,2.0,2.0,0.0,1.0,1.0,1.0,,,,2.0,2.0,2.0,2.0,3.0,2.0,2.0,2.0,2.0,2.0,3.0,2.0,3.0,1.0,3.0,3.0,3.0,3.0,1.0,0.0,2.0,,,0.0,,0.0,5.0,0.0,1.0,,1.0,4.0,2.0,2.0,4.0,4.0,1.0,3.0,4.0,1.0,1.0,5.0,3.0,5.0,4.0,4.0,1.0,2.0,3.0,4.0,2.0,4.0,1.0,4.0,4.0,5.0,5.0,5.0,2.0,2.0,3.0,4.0,4.0,,,,,,2.0,3.0,5.0,5.0,3.0,5.0,2.0,3.0,2.0,3.0,3.0,4.0,,,5.0,4.0,5.0,5.0,5.0,5.0,1.0,4.0,5.0,1.0,1.0,4.0,4.0,4.0,1.0,4.0,4.0,5.0,5.0,5.0,5.0,5.0,1.0,4.0,5.0,1.0,2.0,1.0,5.0,5.0,5.0,5.0,5.0,5.0,5.0,5.0,5.0,5.0,,,,,,,,,,,,,,,,,,,,,,,,,,,,,,,,,,,,,,,,,,,,,,,,,,,,,
1.0,19.0,3.0,2.0,,5.0,,1.0,1.0,1.0,,7.0,3.0,,1.0,1.0,1.0,0.0,1.0,2.0,1,,10 months ago,,2.0,10 months ago,,8.0,,,,,,,2.0,,2.0,2.0,7.0,1.0,,4.0,0.0,0.0,0.0,1.0,0.0,,2.0,0.0,0.0,5.0,2.0,0.0,1.0,0.0,5.0,3.0,2.0,0.0,5.0,0.0,2.0,,,,,,,2.0,4.0,4.0,1.0,2.0,1.0,7.0,7.0,2.0,7.0,7.0,7.0,,,2.0,1.0,2.0,2.0,0.0,0.0,1.0,1.0,2.0,0.0,1.0,0.0,3.0,3.0,2.0,0.0,1.0,1.0,0.0,,,,3.0,3.0,2.0,3.0,3.0,3.0,3.0,3.0,3.0,2.0,3.0,2.0,,1.0,2.0,3.0,3.0,3.0,3.0,1.0,3.0,,,0.0,,0.0,5.0,0.0,1.0,,3.0,3.0,2.0,2.0,3.0,5.0,1.0,1.0,2.0,1.0,5.0,3.0,5.0,5.0,5.0,5.0,5.0,4.0,1.0,3.0,1.0,3.0,1.0,5.0,2.0,5.0,5.0,1.0,1.0,2.0,1.0,1.0,3.0,,,,,,2.0,2.0,1.0,2.0,2.0,2.0,2.0,2.0,2.0,2.0,2.0,3.0,,,4.0,4.0,3.0,5.0,4.0,4.0,1.0,4.0,3.0,1.0,3.0,4.0,4.0,3.0,2.0,4.0,4.0,5.0,5.0,5.0,5.0,5.0,1.0,3.0,5.0,1.0,1.0,1.0,5.0,5.0,5.0,3.0,3.0,3.0,1.0,3.0,3.0,3.0,,,,,,,,,,,,,,,,,,,,,,,,,,,,,,,,,,,,,,,,,,,,,,,,,,,,,
1.0,37.0,6.0,2.0,,1.0,,3.0,2.0,1.0,,6.0,3.0,,1.0,1.0,1.0,0.0,1.0,1.0,4,3.0,3 years,,2.0,2 months,,7.0,,,,,,,1.0,3.0,2.0,7.0,8.0,1.0,,2.0,4.0,1.0,3.0,1.0,4.0,,0.0,4.0,5.0,4.0,1.0,0.0,2.0,0.0,2.0,2.0,4.0,1.0,5.0,3.0,5.0,,,,,,,2.0,7.0,5.0,6.0,1.0,5.0,4.0,6.0,2.0,3.0,4.0,7.0,,,3.0,3.0,3.0,3.0,4.0,3.0,3.0,3.0,2.0,1.0,3.0,3.0,2.0,3.0,2.0,4.0,2.0,2.0,2.0,,,,3.0,3.0,1.0,2.0,2.0,3.0,3.0,2.0,2.0,0.0,3.0,1.0,2.0,2.0,2.0,1.0,1.0,2.0,2.0,3.0,3.0,,,0.0,,0.0,5.0,0.0,1.0,,1.0,5.0,2.0,2.0,4.0,5.0,3.0,3.0,5.0,5.0,1.0,4.0,5.0,5.0,5.0,3.0,1.0,5.0,1.0,3.0,4.0,5.0,1.0,5.0,5.0,3.0,3.0,3.0,1.0,2.0,5.0,1.0,2.0,,,,,,3.0,2.0,2.0,2.0,1.0,2.0,1.0,2.0,1.0,3.0,2.0,3.0,,,4.0,5.0,4.0,4.0,3.0,4.0,1.0,4.0,4.0,2.0,4.0,3.0,4.0,4.0,5.0,3.0,2.0,5.0,3.0,4.0,5.0,4.0,2.0,2.0,4.0,1.0,3.0,1.0,3.0,3.0,4.0,4.0,4.0,3.0,4.0,3.0,4.0,4.0,,,,,,,,,,,,,,,,,,,,,,,,,,,,,,,,,,,,,,,,,,,,,,,,,,,,,
1.0,20.0,4.0,2.0,,2.0,,3.0,3.0,1.0,,6.0,5.0,,1.0,1.0,1.0,0.0,1.0,2.0,1,,4 months,,1.0,4 months,,6.0,,,,,,,2.0,,2.0,9.0,9.0,1.0,,5.0,4.0,4.0,5.0,5.0,5.0,,5.0,5.0,5.0,5.0,0.0,1.0,4.0,0.0,4.0,5.0,5.0,2.0,5.0,5.0,4.0,,,,,,,1.0,7.0,3.0,7.0,1.0,6.0,2.0,6.0,1.0,7.0,2.0,7.0,,,2.0,4.0,4.0,4.0,4.0,0.0,0.0,4.0,4.0,3.0,4.0,4.0,4.0,4.0,4.0,2.0,3.0,4.0,4.0,,,,3.0,3.0,3.0,3.0,3.0,3.0,3.0,3.0,3.0,3.0,3.0,2.0,3.0,3.0,3.0,3.0,3.0,3.0,3.0,3.0,3.0,,,0.0,,0.0,5.0,0.0,1.0,,4.0,2.0,2.0,2.0,3.0,4.0,2.0,1.0,4.0,5.0,4.0,4.0,5.0,5.0,3.0,5.0,4.0,4.0,1.0,1.0,3.0,2.0,1.0,3.0,5.0,5.0,5.0,2.0,2.0,5.0,3.0,2.0,5.0,,,,,,4.0,5.0,4.0,4.0,4.0,4.0,4.0,4.0,4.0,4.0,4.0,4.0,,,4.0,4.0,4.0,4.0,3.0,5.0,4.0,3.0,5.0,3.0,3.0,5.0,5.0,5.0,2.0,5.0,5.0,5.0,5.0,5.0,5.0,5.0,1.0,2.0,4.0,1.0,2.0,1.0,5.0,5.0,5.0,5.0,5.0,4.0,5.0,5.0,3.0,5.0,,,,,,,,,,,,,,,,,,,,,,,,,,,,,,,,,,,,,,,,,,,,,,,,,,,,,
1.0,22.0,4.0,2.0,,3.0,,3.0,2.0,1.0,,6.0,5.0,,1.0,1.0,1.0,0.0,1.0,2.0,1,0.5,6 months,,2.0,6 months,,10.0,,,,,,,2.0,,2.0,2.0,7.0,1.0,,4.0,3.0,0.0,2.0,0.0,2.0,,3.0,1.0,4.0,3.0,3.0,1.0,0.0,0.0,2.0,4.0,2.0,0.0,4.0,0.0,1.0,,,,,,,1.0,6.0,3.0,4.0,1.0,5.0,2.0,5.0,1.0,6.0,2.0,5.0,,,3.0,3.0,4.0,3.0,2.0,4.0,2.0,2.0,2.0,3.0,1.0,2.0,3.0,3.0,2.0,1.0,1.0,1.0,1.0,,,,3.0,3.0,1.0,1.0,2.0,1.0,3.0,1.0,3.0,2.0,3.0,0.0,1.0,1.0,1.0,0.0,2.0,3.0,1.0,1.0,1.0,,,0.0,,0.0,5.0,0.0,0.0,,0.0,0.0,0.0,1.0,4.0,5.0,2.0,3.0,4.0,1.0,3.0,4.0,5.0,5.0,3.0,4.0,1.0,4.0,2.0,3.0,3.0,4.0,1.0,5.0,3.0,5.0,4.0,4.0,1.0,5.0,4.0,1.0,5.0,,,,,,3.0,3.0,4.0,3.0,1.0,4.0,3.0,2.0,3.0,2.0,3.0,4.0,,,5.0,3.0,4.0,5.0,5.0,5.0,2.0,3.0,5.0,1.0,1.0,4.0,5.0,4.0,1.0,5.0,3.0,5.0,5.0,5.0,5.0,5.0,2.0,3.0,5.0,1.0,2.0,1.0,4.0,4.0,4.0,5.0,5.0,5.0,4.0,5.0,5.0,5.0,,,,,,,,,,,,,,,,,,,,,,,,,,,,,,,,,,,,,,,,,,,,,,,,,,,,,
1.0,32.0,4.0,2.0,,6.0,,3.0,3.0,1.0,,6.0,3.0,,1.0,1.0,1.0,0.0,1.0,2.0,1,,3 months,,1.0,3 months,,10.0,,,,,,,1.0,2.0,2.0,9.0,9.0,1.0,,5.0,5.0,0.0,4.0,0.0,3.0,,3.0,5.0,3.0,5.0,3.0,2.0,3.0,0.0,5.0,5.0,5.0,0.0,5.0,5.0,5.0,,,,,,,2.0,6.0,7.0,7.0,4.0,2.0,5.0,3.0,5.0,5.0,2.0,4.0,,,4.0,4.0,4.0,2.0,1.0,2.0,2.0,2.0,1.0,2.0,3.0,2.0,1.0,4.0,1.0,4.0,2.0,2.0,0.0,,,,3.0,3.0,3.0,3.0,3.0,3.0,3.0,3.0,3.0,3.0,3.0,3.0,3.0,3.0,3.0,3.0,3.0,3.0,1.0,3.0,3.0,,,0.0,,0.0,5.0,0.0,1.0,,4.0,1.0,2.0,2.0,5.0,5.0,1.0,1.0,5.0,5.0,1.0,3.0,5.0,5.0,5.0,5.0,1.0,1.0,1.0,2.0,4.0,5.0,1.0,1.0,5.0,5.0,5.0,5.0,5.0,5.0,5.0,5.0,5.0,,,,,,3.0,3.0,3.0,2.0,2.0,2.0,2.0,3.0,3.0,2.0,2.0,2.0,,,2.0,3.0,4.0,2.0,3.0,3.0,3.0,3.0,4.0,2.0,3.0,3.0,2.0,3.0,3.0,,,,,,,,,,,,,,,,,2.0,3.0,3.0,1.0,3.0,2.0,2.0,,,,,,,,,,,,,,,,,,,,,,,,,,,,,,,,,,,,,,,,,,,,,,,,,,,,,
1.0,23.0,4.0,1.0,,2.0,,5.0,3.0,1.0,,6.0,1.0,,1.0,1.0,1.0,0.0,1.0,2.0,1,,2-3 months,,1.0,1 year,,6.0,,,,,,,2.0,,2.0,9.0,9.0,1.0,,5.0,5.0,2.0,3.0,5.0,0.0,,2.0,4.0,0.0,1.0,3.0,3.0,3.0,4.0,5.0,5.0,5.0,5.0,3.0,3.0,4.0,,,,,,,4.0,7.0,7.0,3.0,4.0,7.0,7.0,7.0,5.0,4.0,4.0,3.0,,,4.0,4.0,3.0,4.0,0.0,0.0,4.0,0.0,1.0,2.0,2.0,1.0,1.0,1.0,1.0,1.0,1.0,2.0,0.0,,,,3.0,3.0,3.0,3.0,3.0,3.0,3.0,3.0,3.0,3.0,3.0,3.0,3.0,3.0,2.0,1.0,1.0,3.0,3.0,3.0,3.0,,,0.0,,0.0,5.0,0.0,0.0,,0.0,0.0,0.0,1.0,5.0,5.0,5.0,3.0,3.0,1.0,2.0,5.0,5.0,5.0,5.0,5.0,3.0,5.0,3.0,1.0,1.0,3.0,1.0,3.0,5.0,5.0,5.0,1.0,3.0,3.0,4.0,3.0,5.0,,,,,,1.0,1.0,3.0,1.0,3.0,3.0,1.0,5.0,3.0,3.0,3.0,2.0,,,3.0,5.0,5.0,2.0,1.0,1.0,2.0,2.0,2.0,2.0,2.0,3.0,3.0,3.0,3.0,1.0,1.0,1.0,1.0,1.0,1.0,1.0,1.0,3.0,3.0,3.0,3.0,3.0,3.0,1.0,2.0,2.0,3.0,4.0,3.0,2.0,1.0,1.0,,,,,,,,,,,,,,,,,,,,,,,,,,,,,,,,,,,,,,,,,,,,,,,,,,,,,
1.0,30.0,4.0,2.0,,2.0,,8.0,4.0,3.0,,6.0,4.0,,1.0,1.0,1.0,0.0,1.0,2.0,1,0.008,3 weeks,0.008,1.0,3 weeks,1.0,7.0,,,,,,,1.0,2.0,2.0,9.0,6.0,1.0,Work has not allowed me any time off to actually have my miscarriage nor have time to grieve. Normally I might have told family of the pregnancy or miscarriage in person but covid isn’t allowing anything in person. I had follow up for my miscarriage and had to go to the appointment without support as covid doesn’t allow more people to come other than the patient unless it’s specific pregnancy appointments.,4.0,1.0,0.0,1.0,2.0,1.0,5.0,2.0,1.0,3.0,5.0,4.0,2.0,2.0,1.0,5.0,0.0,1.0,2.0,5.0,0.0,2.0,44.0,12.0,8.0,13.0,2.0,7.0,1.0,5.0,5.0,3.0,2.0,1.0,1.0,1.0,2.0,6.0,1.0,3.0,19.0,12.0,2.0,2.0,2.0,2.0,1.0,2.0,2.0,3.0,2.0,2.0,3.0,3.0,3.0,3.0,4.0,4.0,4.0,2.0,4.0,36.0,14.0,50.0,3.0,3.0,3.0,3.0,3.0,3.0,3.0,3.0,2.0,3.0,3.0,3.0,3.0,1.0,1.0,2.0,3.0,2.0,1.0,3.0,3.0,29.0,22.0,0.0,,0.0,5.0,0.0,1.0,Facebook,1.0,6.0,2.0,2.0,5.0,5.0,5.0,1.0,2.0,3.0,4.0,4.0,5.0,5.0,4.0,1.0,5.0,3.0,4.0,1.0,3.0,3.0,5.0,5.0,4.0,5.0,3.0,2.0,1.0,3.0,3.0,2.0,5.0,24.0,19.0,27.0,26.0,101.0,3.0,1.0,2.0,2.0,2.0,2.0,1.0,4.0,1.0,3.0,1.0,2.0,24.0,1.0,5.0,3.0,3.0,3.0,4.0,5.0,5.0,4.0,4.0,5.0,4.0,5.0,5.0,4.0,5.0,4.0,4.0,5.0,5.0,5.0,5.0,5.0,5.0,3.0,4.0,4.0,4.0,4.0,4.0,3.0,5.0,5.0,5.0,5.0,5.0,3.0,5.0,5.0,14.0,20.0,9.0,17.0,18.0,22.0,9.0,19.0,23.0,10.0,151.0,-0.4109330020851492,-0.6699742721217092,-0.3390714051936735,0.22145964650418057,-0.3129184410205707,-0.6175632626424157,-0.31444235127412445,-0.015118166605518365,1.9342533579566592,0.5782026204063343,1.3892905061178618,0.7534649958497538,0.3246135560216354,-1.118096071714957,1.2850716425388118,0.14054113219418418,0.33221602974886355,-1.1851789301015447,-0.3927650766994065,0.3957281505096375,0.6550787486934978,0.1285322385393251,1.4889268625050263,0.8208079069096433,0.9435356567633147,0.8657019225831325,1.0815372761523916,1.086848977505144,1.0085559002204734,2.7420599699053625,-0.7420599699053625,0.31162917586850175,-0.4684354318574013,2.85368403223718,-0.8536840322371799,0.465273553932512,-0.5434114952418841,2.4111633314060783,-0.4111633314060783,-0.5904182802131227,-0.25267771200811995,1.0
1.0,34.0,4.0,2.0,,6.0,,5.0,3.0,3.0,,6.0,5.0,,1.0,1.0,1.0,0.0,1.0,1.0,8,4.5,4.5 years,0.008,1.0,3 weeks,8.0,8.0,,,18.0,,8.0,8.0,1.0,2.0,2.0,9.0,,1.0,Unable to physically connect with close friends and family due to the restrictions in place to reduce expose to those outside of the nuclear family group.,1.0,2.0,0.0,3.0,5.0,2.0,5.0,0.0,3.0,3.0,4.0,1.0,2.0,2.0,0.0,2.0,3.0,1.0,5.0,4.0,2.0,3.0,48.0,18.0,2.0,13.0,5.0,5.0,1.0,5.0,2.0,1.0,1.0,3.0,1.0,2.0,1.0,3.0,1.0,1.0,15.0,7.0,2.0,2.0,2.0,2.0,3.0,4.0,3.0,4.0,3.0,1.0,2.0,3.0,3.0,3.0,3.0,0.0,1.0,0.0,1.0,40.0,2.0,42.0,1.0,0.0,0.0,1.0,1.0,0.0,1.0,0.0,2.0,1.0,2.0,2.0,1.0,0.0,1.0,0.0,3.0,0.0,0.0,3.0,1.0,7.0,11.0,0.0,,,,,0.0,,0.0,1.0,0.0,1.0,1.0,5.0,4.0,1.0,5.0,2.0,5.0,4.0,5.0,5.0,2.0,2.0,5.0,1.0,5.0,2.0,5.0,4.0,5.0,5.0,4.0,4.0,5.0,5.0,1.0,4.0,5.0,1.0,4.0,21.0,24.0,25.0,32.0,106.0,4.0,4.0,4.0,4.0,4.0,4.0,5.0,5.0,4.0,5.0,5.0,4.0,52.0,1.0,4.0,4.0,5.0,4.0,4.0,5.0,4.0,5.0,5.0,5.0,4.0,4.0,5.0,5.0,4.0,4.0,3.0,3.0,2.0,5.0,5.0,4.0,4.0,3.0,4.0,4.0,5.0,5.0,4.0,4.0,5.0,5.0,5.0,5.0,5.0,5.0,5.0,5.0,17.0,20.0,9.0,18.0,12.0,24.0,9.0,17.0,25.0,10.0,151.0,-0.2393668086700206,0.005508524333992082,-1.2574864288372793,0.22145964650418057,1.2596158564939708,-1.1671129501039479,-1.0877452021274303,0.3449690743622778,-0.9524259970776926,-0.0016727173203668947,-0.8888957265256355,-0.4409986299238265,-0.5665425270189067,0.45540128185124495,0.5650409976215288,1.5203995210097954,0.8384671379887179,1.1617213698147157,0.6133766295208251,0.3957281505096375,0.6550787486934978,0.4594073080465051,-0.25894380217478546,1.2621209447250794,0.9435356567633147,0.3715539842023466,1.5247622041958562,1.086848977505144,1.0085559002204734,2.810491186353092,-0.8104911863530919,0.43311490684527715,-0.5116335664142452,2.712919308596728,-0.712919308596728,0.18417619844433503,-0.4538078877451981,,,,,1.0
1.0,32.0,4.0,1.0,,2.0,,8.0,4.0,3.0,,6.0,4.0,,1.0,1.0,1.0,0.0,1.0,1.0,2,0.17,2 months,0.008,1.0,1 week,2.0,6.0,5.0,,,,,,2.0,,2.0,5.0,3.0,1.0,"Limited ability to receive social support. If I want to get support from someone, I have to reach out to tell them, rather than seeing them and having it come up in conversation",1.0,3.0,0.0,0.0,0.0,4.0,5.0,0.0,2.0,3.0,4.0,2.0,4.0,4.0,1.0,4.0,4.0,2.0,0.0,5.0,2.0,3.0,48.0,22.0,5.0,13.0,0.0,8.0,1.0,5.0,2.0,2.0,1.0,3.0,1.0,2.0,2.0,6.0,2.0,6.0,24.0,9.0,4.0,3.0,4.0,2.0,3.0,3.0,3.0,3.0,1.0,1.0,3.0,4.0,0.0,4.0,2.0,3.0,3.0,2.0,1.0,40.0,9.0,49.0,1.0,0.0,1.0,0.0,1.0,1.0,2.0,1.0,1.0,0.0,3.0,1.0,1.0,0.0,1.0,1.0,2.0,2.0,2.0,2.0,3.0,8.0,15.0,0.0,,0.0,5.0,0.0,0.0,,0.0,1.0,0.0,1.0,4.0,3.0,4.0,4.0,3.0,4.0,4.0,3.0,3.0,5.0,3.0,2.0,4.0,4.0,3.0,2.0,4.0,1.0,3.0,3.0,4.0,3.0,4.0,4.0,2.0,2.0,4.0,2.0,3.0,21.0,21.0,21.0,28.0,94.0,4.0,2.0,3.0,2.0,1.0,3.0,2.0,2.0,4.0,3.0,3.0,2.0,31.0,1.0,4.0,4.0,4.0,3.0,5.0,5.0,5.0,3.0,4.0,5.0,5.0,4.0,3.0,4.0,4.0,3.0,4.0,3.0,3.0,4.0,5.0,4.0,4.0,3.0,5.0,4.0,3.0,4.0,4.0,3.0,4.0,4.0,3.0,4.0,4.0,5.0,5.0,5.0,15.0,19.0,8.0,15.0,13.0,20.0,8.0,19.0,20.0,10.0,137.0,-0.2393668086700206,0.45583038863779296,-0.7982789170154764,0.22145964650418057,-1.3612746393635984,0.06937384668449956,-0.7784240617861079,0.3449690743622778,0.7314702933590127,0.5057182031904967,-0.7853418068600221,-0.006648220551615506,-0.5665425270189067,-0.4886971302884763,-0.8750202922130371,0.6004939284660545,-0.37653552178693245,-0.5984538551224797,-0.057384507959329326,0.038607624439963704,0.04429358087251368,-0.5332179004750349,0.03236797527184981,0.37949486909420715,0.478809139253026,0.8657019225831325,0.4166998840871948,1.086848977505144,0.29202961886981327,2.2794711466466184,1.7205288533533816,-0.5096033588212944,1.0861072004011982,2.753184652547031,1.2468153474529688,0.26458328773157924,0.7936587386721874,2.8108687595605337,1.1891312404394663,1.1485139275172684,0.7307727566174207,1.0
1.0,27.0,4.0,2.0,,2.0,,5.0,2.0,3.0,,6.0,4.0,,1.0,1.0,1.0,0.0,1.0,2.0,1,0.008,3 weeks,0.008,1.0,3 weeks,1.0,10.0,,,,,,,1.0,2.0,2.0,9.0,9.0,1.0,"Only the patient was allowed at doctors appointment so I was told by myself that my baby had no heartbeat. I then had doctors appointments both for the treatment of the missed miscarriage and the follow-up of care by myself. If Covid-19 has not been here, I would have had support at all appointments",3.0,3.0,0.0,1.0,3.0,3.0,5.0,0.0,1.0,2.0,4.0,1.0,1.0,2.0,1.0,3.0,3.0,1.0,3.0,3.0,1.0,2.0,41.0,15.0,3.0,9.0,3.0,8.0,3.0,6.0,6.0,5.0,3.0,4.0,2.0,6.0,2.0,6.0,2.0,2.0,29.0,18.0,3.0,3.0,3.0,0.0,3.0,2.0,3.0,4.0,3.0,0.0,3.0,4.0,4.0,4.0,1.0,0.0,0.0,1.0,0.0,40.0,1.0,41.0,3.0,3.0,3.0,3.0,3.0,3.0,3.0,3.0,3.0,3.0,3.0,3.0,1.0,2.0,1.0,0.0,3.0,2.0,3.0,3.0,3.0,30.0,21.0,0.0,,0.0,5.0,0.0,1.0,Comments on an app in a forum for pregnancy loss and child loss,4.0,2.0,2.0,2.0,3.0,4.0,5.0,1.0,4.0,3.0,4.0,5.0,4.0,5.0,5.0,2.0,4.0,2.0,3.0,2.0,1.0,2.0,5.0,3.0,4.0,5.0,5.0,3.0,2.0,3.0,4.0,3.0,4.0,27.0,23.0,21.0,25.0,100.0,2.0,4.0,3.0,3.0,2.0,3.0,2.0,3.0,2.0,3.0,1.0,1.0,29.0,1.0,3.0,2.0,4.0,3.0,2.0,2.0,3.0,2.0,3.0,4.0,4.0,2.0,2.0,2.0,3.0,3.0,1.0,2.0,1.0,4.0,5.0,4.0,3.0,1.0,4.0,4.0,3.0,4.0,4.0,3.0,4.0,3.0,3.0,2.0,1.0,2.0,1.0,2.0,12.0,16.0,8.0,14.0,7.0,11.0,4.0,14.0,11.0,3.0,97.0,-0.5396076471464957,-0.3322328738938586,-1.1044172582300116,-0.6019959404972793,0.2112596581509431,0.7563109560114147,0.6135210697498426,0.3449690743622778,-1.1929826099972218,-0.07415713453620454,1.4928444257834752,0.644877393506701,1.2157696390621775,0.14070181113800453,-0.8750202922130371,-0.08943526594175104,0.23096580810089268,-0.766089590830784,-1.063526214179561,-1.0327539537690578,0.04429358087251368,-0.8640929699822149,-1.715502689407962,-1.6064138010752556,-1.380096930788129,-0.3696679233688323,-1.5778122921083955,-2.0035092003932053,-1.7551883278463587,1.9475367386759679,-0.9475367386759679,-1.0988855063841656,-0.5981454321529264,2.6397253896483397,-1.6397253896483397,0.038013036807612616,-1.043765131040105,2.282784737980556,-1.2827847379805561,-1.1489337647826738,-0.7883268955026054,1.0
1.0,30.0,3.0,2.0,,1.0,,3.0,2.0,1.0,,6.0,3.0,,1.0,1.0,1.0,0.0,1.0,1.0,4,6.0,6 years,0.008,1.0,4 days,4.0,6.0,10.0,8.0,4.0,,,,1.0,3.0,2.0,1.0,2.0,1.0,Due to exposure to COVID-19 I've had to quarantine myself throughout the miscarriage. Being alone makes it much harder.,3.0,3.0,3.0,3.0,0.0,2.0,5.0,4.0,3.0,1.0,3.0,2.0,3.0,2.0,0.0,0.0,2.0,4.0,0.0,2.0,0.0,3.0,43.0,11.0,13.0,11.0,0.0,8.0,2.0,3.0,5.0,5.0,2.0,3.0,6.0,3.0,2.0,3.0,2.0,5.0,22.0,19.0,0.0,0.0,0.0,1.0,2.0,2.0,4.0,3.0,3.0,0.0,2.0,3.0,0.0,3.0,2.0,0.0,0.0,0.0,0.0,25.0,0.0,25.0,2.0,2.0,2.0,2.0,2.0,2.0,3.0,3.0,2.0,3.0,3.0,3.0,3.0,2.0,3.0,2.0,3.0,2.0,1.0,2.0,3.0,23.0,24.0,0.0,,0.0,5.0,0.0,1.0,Comments in support of mothers who experienced loss.,2.0,6.0,2.0,2.0,4.0,5.0,4.0,2.0,4.0,2.0,4.0,3.0,5.0,5.0,3.0,1.0,4.0,3.0,5.0,2.0,3.0,4.0,5.0,3.0,5.0,3.0,4.0,3.0,1.0,5.0,4.0,1.0,4.0,22.0,24.0,25.0,26.0,101.0,5.0,5.0,5.0,5.0,3.0,4.0,5.0,5.0,4.0,5.0,4.0,5.0,55.0,2.0,,,,,,,,,,,,,,,,,,,,,,,,,,,,,,,,,,,,,,,,,,,,,,,,,,-0.4538245504389314,-0.7825547381976595,0.4262744478426646,-0.19026814699654937,-1.3612746393635984,-0.20540099704626652,0.7681816399205037,-1.0053580792669579,-1.4335392229167512,-1.233907809989607,0.7679669881241807,0.9706402005358593,-0.269490499338726,0.45540128185124495,0.5650409976215288,0.14054113219418418,0.33221602974886355,1.4131749733771721,,,,,,,,,,,,,,,,2.560625947874898,0.43937405212510194,-0.11994304286969554,0.2796829993529175,2.2951448020633856,0.7048551979366144,-1.0951608810305469,0.4331641104827894,1.0